{"text_format":"3","workbook":"xlsx","n_sheets":7,"sheets":["Project Parameters","Actuals","Actual Totals","Monthly Billings","Billing Timeline","Account Billing","Skill Type Billing"],"not_rendered":{"charts":6,"defined_names":3},"unopened":[{"sheet":"Billing Timeline","index":4,"reason":"not_a_worksheet"},{"sheet":"Account Billing","index":5,"reason":"not_a_worksheet"},{"sheet":"Skill Type Billing","index":6,"reason":"not_a_worksheet"}],"read":"whole","date_system":"1900"}

{"sheet":"Project Parameters","index":0,"n_rows":13,"n_cols":9,"rows_kept":13}
[null,"[Company Name]  "]
[null,{"$f":" Actuals!B2","v":"Project Analysis for Business Consulting Firms"}]
[null,"Company Confidential"]
[null,"Dark gray cells will be calculated for you. You do not need to enter anything into them."]
[null,"Project type","Account manager","Project manager","Business analyst","Process specialist","Finance specialist","Administration staff","Total"]
[null,"Business continuity planning",{"v":0.1,"d":"10%"},{"v":0.2,"d":"20%"},{"v":0.4,"d":"40%"},{"v":0.1,"d":"10%"},{"v":0.1,"d":"10%"},{"v":0.1,"d":"10%"},{"$f":"SUM(C6:H6)","v":{"v":1,"d":"100%"}}]
[null,"Business process re-engineering",{"v":0.1,"d":"10%"},{"v":0.1,"d":"10%"},{"v":0.1,"d":"10%"},{"v":0.5,"d":"50%"},{"v":0.1,"d":"10%"},{"v":0.1,"d":"10%"},{"v":1,"d":"100%"}]
[null,"Cost reduction",{"v":0.1,"d":"10%"},{"v":0.2,"d":"20%"},{"v":0.1,"d":"10%"},{"v":0.2,"d":"20%"},{"v":0.3,"d":"30%"},{"v":0.1,"d":"10%"},{"v":1.0000000000000002,"d":"100%"}]
{"$rows_left_out":6}
{"sheet":"Actuals","index":1,"n_rows":30,"n_cols":7,"rows_kept":30}
[null,"[Company Name]  "]
[null,"Project Analysis for Business Consulting Firms"]
[null,"Company Confidential"]
[]
[null,"Dark gray cells will be calculated for you. You do not need to enter anything into them."]
[null,"Project name","Project type","Actual start","Actual finish","Actual work in hours","Duration in days"]
[null,"A. Datum Corporation","Business continuity planning","2004-01-04","2004-03-04",200,{"$f":"DAYS360(D7,E7,FALSE)","v":60}]
[null,"Adventure Works","Business process re-engineering","2004-01-20","2004-02-21",400,{"$f":"DAYS360(D8,E8,FALSE)","v":31}]
{"$rows_left_out":23}
{"sheet":"Actual Totals","index":2,"n_rows":29,"n_cols":10,"rows_kept":29}
[null,"[Company Name]  "]
[null,{"$f":" Actuals!B2","v":"Project Analysis for Business Consulting Firms"}]
[null,"Company Confidential"]
[]
[null,"Project name",{"$f":"'Project Parameters'!C5","v":"Account manager"},{"$f":"'Project Parameters'!D5","v":"Project manager"},{"$f":"'Project Parameters'!E5","v":"Business analyst"},{"$f":"'Project Parameters'!F5","v":"Process specialist"},{"$f":"'Project Parameters'!G5","v":"Finance specialist"},{"$f":"'Project Parameters'!H5","v":"Administration staff"},"Month of completion","Total\nbillings"]
[null,"A. Datum Corporation",{"$f":" IF( Actuals!$C7 = 'Project Parameters'!$B$6, 'Project Parameters'!C$6 * 'Project Parameters'!C$13 * Actuals!$F7, IF(Actuals!$C7 = 'Project Parameters'!$B$7, 'Project Parameters'!C$7 * 'Project Parameters'!C$13 * Actuals!$F7, IF(Actuals!$C7 = 'Project Parameters'!$B$8, 'Project Parameters'!C$8 * 'Project Parameters'!C$13 * Actuals!$F7, IF(Actuals!$C7 = 'Project Parameters'!$B$9, 'Project Parameters'!C$9 * 'Project Parameters'!C$13 * Actuals!$F7, IF(Actuals!$C7 = 'Project Parameters'!$B$10, 'Project Parameters'!C$10 * 'Project Parameters'!C$13 * Actuals!$F7, IF(Actuals!$C7 = 'Project Parameters'!$B$11, 'Project Parameters'!C$11 * 'Project Parameters'!C$13 * Actuals!$F7,error))))))","v":{"v":5000,"d":"€ 5,000.00"}},{"$f":" IF( Actuals!$C7 = 'Project Parameters'!$B$6, 'Project Parameters'!D$6 * 'Project Parameters'!D$13 * Actuals!$F7, IF(Actuals!$C7 = 'Project Parameters'!$B$7, 'Project Parameters'!D$7 * 'Project Parameters'!D$13 * Actuals!$F7, IF(Actuals!$C7 = 'Project Parameters'!$B$8, 'Project Parameters'!D$8 * 'Project Parameters'!D$13 * Actuals!$F7, IF(Actuals!$C7 = 'Project Parameters'!$B$9, 'Project Parameters'!D$9 * 'Project Parameters'!D$13 * Actuals!$F7, IF(Actuals!$C7 = 'Project Parameters'!$B$10, 'Project Parameters'!D$10 * 'Project Parameters'!D$13 * Actuals!$F7, IF(Actuals!$C7 = 'Project Parameters'!$B$11, 'Project Parameters'!D$11 * 'Project Parameters'!D$13 * Actuals!$F7,error))))))","v":{"v":9000,"d":"€ 9,000.00"}},{"$f":" IF( Actuals!$C7 = 'Project Parameters'!$B$6, 'Project Parameters'!E$6 * 'Project Parameters'!E$13 * Actuals!$F7, IF(Actuals!$C7 = 'Project Parameters'!$B$7, 'Project Parameters'!E$7 * 'Project Parameters'!E$13 * Actuals!$F7, IF(Actuals!$C7 = 'Project Parameters'!$B$8, 'Project Parameters'!E$8 * 'Project Parameters'!E$13 * Actuals!$F7, IF(Actuals!$C7 = 'Project Parameters'!$B$9, 'Project Parameters'!E$9 * 'Project Parameters'!E$13 * Actuals!$F7, IF(Actuals!$C7 = 'Project Parameters'!$B$10, 'Project Parameters'!E$10 * 'Project Parameters'!E$13 * Actuals!$F7, IF(Actuals!$C7 = 'Project Parameters'!$B$11, 'Project Parameters'!E$11 * 'Project Parameters'!E$13 * Actuals!$F7,error))))))","v":{"v":16000,"d":"€ 16,000.00"}},{"$f":" IF( Actuals!$C7 = 'Project Parameters'!$B$6, 'Project Parameters'!F$6 * 'Project Parameters'!F$13 * Actuals!$F7, IF(Actuals!$C7 = 'Project Parameters'!$B$7, 'Project Parameters'!F$7 * 'Project Parameters'!F$13 * Actuals!$F7, IF(Actuals!$C7 = 'Project Parameters'!$B$8, 'Project Parameters'!F$8 * 'Project Parameters'!F$13 * Actuals!$F7, IF(Actuals!$C7 = 'Project Parameters'!$B$9, 'Project Parameters'!F$9 * 'Project Parameters'!F$13 * Actuals!$F7, IF(Actuals!$C7 = 'Project Parameters'!$B$10, 'Project Parameters'!F$10 * 'Project Parameters'!F$13 * Actuals!$F7, IF(Actuals!$C7 = 'Project Parameters'!$B$11, 'Project Parameters'!F$11 * 'Project Parameters'!F$13 * Actuals!$F7,error))))))","v":{"v":3500,"d":"€ 3,500.00"}},{"$f":" IF( Actuals!$C7 = 'Project Parameters'!$B$6, 'Project Parameters'!G$6 * 'Project Parameters'!G$13 * Actuals!$F7, IF(Actuals!$C7 = 'Project Parameters'!$B$7, 'Project Parameters'!G$7 * 'Project Parameters'!G$13 * Actuals!$F7, IF(Actuals!$C7 = 'Project Parameters'!$B$8, 'Project Parameters'!G$8 * 'Project Parameters'!G$13 * Actuals!$F7, IF(Actuals!$C7 = 'Project Parameters'!$B$9, 'Project Parameters'!G$9 * 'Project Parameters'!G$13 * Actuals!$F7, IF(Actuals!$C7 = 'Project Parameters'!$B$10, 'Project Parameters'!G$10 * 'Project Parameters'!G$13 * Actuals!$F7, IF(Actuals!$C7 = 'Project Parameters'!$B$11, 'Project Parameters'!G$11 * 'Project Parameters'!G$13 * Actuals!$F7,error))))))","v":{"v":3000,"d":"€ 3,000.00"}},{"$f":" IF( Actuals!$C7 = 'Project Parameters'!$B$6, 'Project Parameters'!H$6 * 'Project Parameters'!H$13 * Actuals!$F7, IF(Actuals!$C7 = 'Project Parameters'!$B$7, 'Project Parameters'!H$7 * 'Project Parameters'!H$13 * Actuals!$F7, IF(Actuals!$C7 = 'Project Parameters'!$B$8, 'Project Parameters'!H$8 * 'Project Parameters'!H$13 * Actuals!$F7, IF(Actuals!$C7 = 'Project Parameters'!$B$9, 'Project Parameters'!H$9 * 'Project Parameters'!H$13 * Actuals!$F7, IF(Actuals!$C7 = 'Project Parameters'!$B$10, 'Project Parameters'!H$10 * 'Project Parameters'!H$13 * Actuals!$F7, IF(Actuals!$C7 = 'Project Parameters'!$B$11, 'Project Parameters'!H$11 * 'Project Parameters'!H$13 * Actuals!$F7,error))))))","v":{"v":1000,"d":"€ 1,000.00"}},{"$f":"MONTH(Actuals!E7)","v":3},{"$f":"SUM(C6:H6)","v":{"v":37500,"d":"€ 37,500.00"}}]
[null,"Adventure Works",{"$f":" IF( Actuals!$C8 = 'Project Parameters'!$B$6, 'Project Parameters'!C$6 * 'Project Parameters'!C$13 * Actuals!$F8, IF(Actuals!$C8 = 'Project Parameters'!$B$7, 'Project Parameters'!C$7 * 'Project Parameters'!C$13 * Actuals!$F8, IF(Actuals!$C8 = 'Project Parameters'!$B$8, 'Project Parameters'!C$8 * 'Project Parameters'!C$13 * Actuals!$F8, IF(Actuals!$C8 = 'Project Parameters'!$B$9, 'Project Parameters'!C$9 * 'Project Parameters'!C$13 * Actuals!$F8, IF(Actuals!$C8 = 'Project Parameters'!$B$10, 'Project Parameters'!C$10 * 'Project Parameters'!C$13 * Actuals!$F8, IF(Actuals!$C8 = 'Project Parameters'!$B$11, 'Project Parameters'!C$11 * 'Project Parameters'!C$13 * Actuals!$F8,error))))))","v":{"v":10000,"d":"€ 10,000.00"}},{"$f":" IF( Actuals!$C8 = 'Project Parameters'!$B$6, 'Project Parameters'!D$6 * 'Project Parameters'!D$13 * Actuals!$F8, IF(Actuals!$C8 = 'Project Parameters'!$B$7, 'Project Parameters'!D$7 * 'Project Parameters'!D$13 * Actuals!$F8, IF(Actuals!$C8 = 'Project Parameters'!$B$8, 'Project Parameters'!D$8 * 'Project Parameters'!D$13 * Actuals!$F8, IF(Actuals!$C8 = 'Project Parameters'!$B$9, 'Project Parameters'!D$9 * 'Project Parameters'!D$13 * Actuals!$F8, IF(Actuals!$C8 = 'Project Parameters'!$B$10, 'Project Parameters'!D$10 * 'Project Parameters'!D$13 * Actuals!$F8, IF(Actuals!$C8 = 'Project Parameters'!$B$11, 'Project Parameters'!D$11 * 'Project Parameters'!D$13 * Actuals!$F8,error))))))","v":{"v":9000,"d":"€ 9,000.00"}},{"$f":" IF( Actuals!$C8 = 'Project Parameters'!$B$6, 'Project Parameters'!E$6 * 'Project Parameters'!E$13 * Actuals!$F8, IF(Actuals!$C8 = 'Project Parameters'!$B$7, 'Project Parameters'!E$7 * 'Project Parameters'!E$13 * Actuals!$F8, IF(Actuals!$C8 = 'Project Parameters'!$B$8, 'Project Parameters'!E$8 * 'Project Parameters'!E$13 * Actuals!$F8, IF(Actuals!$C8 = 'Project Parameters'!$B$9, 'Project Parameters'!E$9 * 'Project Parameters'!E$13 * Actuals!$F8, IF(Actuals!$C8 = 'Project Parameters'!$B$10, 'Project Parameters'!E$10 * 'Project Parameters'!E$13 * Actuals!$F8, IF(Actuals!$C8 = 'Project Parameters'!$B$11, 'Project Parameters'!E$11 * 'Project Parameters'!E$13 * Actuals!$F8,error))))))","v":{"v":8000,"d":"€ 8,000.00"}},{"$f":" IF( Actuals!$C8 = 'Project Parameters'!$B$6, 'Project Parameters'!F$6 * 'Project Parameters'!F$13 * Actuals!$F8, IF(Actuals!$C8 = 'Project Parameters'!$B$7, 'Project Parameters'!F$7 * 'Project Parameters'!F$13 * Actuals!$F8, IF(Actuals!$C8 = 'Project Parameters'!$B$8, 'Project Parameters'!F$8 * 'Project Parameters'!F$13 * Actuals!$F8, IF(Actuals!$C8 = 'Project Parameters'!$B$9, 'Project Parameters'!F$9 * 'Project Parameters'!F$13 * Actuals!$F8, IF(Actuals!$C8 = 'Project Parameters'!$B$10, 'Project Parameters'!F$10 * 'Project Parameters'!F$13 * Actuals!$F8, IF(Actuals!$C8 = 'Project Parameters'!$B$11, 'Project Parameters'!F$11 * 'Project Parameters'!F$13 * Actuals!$F8,error))))))","v":{"v":35000,"d":"€ 35,000.00"}},{"$f":" IF( Actuals!$C8 = 'Project Parameters'!$B$6, 'Project Parameters'!G$6 * 'Project Parameters'!G$13 * Actuals!$F8, IF(Actuals!$C8 = 'Project Parameters'!$B$7, 'Project Parameters'!G$7 * 'Project Parameters'!G$13 * Actuals!$F8, IF(Actuals!$C8 = 'Project Parameters'!$B$8, 'Project Parameters'!G$8 * 'Project Parameters'!G$13 * Actuals!$F8, IF(Actuals!$C8 = 'Project Parameters'!$B$9, 'Project Parameters'!G$9 * 'Project Parameters'!G$13 * Actuals!$F8, IF(Actuals!$C8 = 'Project Parameters'!$B$10, 'Project Parameters'!G$10 * 'Project Parameters'!G$13 * Actuals!$F8, IF(Actuals!$C8 = 'Project Parameters'!$B$11, 'Project Parameters'!G$11 * 'Project Parameters'!G$13 * Actuals!$F8,error))))))","v":{"v":6000,"d":"€ 6,000.00"}},{"$f":" IF( Actuals!$C8 = 'Project Parameters'!$B$6, 'Project Parameters'!H$6 * 'Project Parameters'!H$13 * Actuals!$F8, IF(Actuals!$C8 = 'Project Parameters'!$B$7, 'Project Parameters'!H$7 * 'Project Parameters'!H$13 * Actuals!$F8, IF(Actuals!$C8 = 'Project Parameters'!$B$8, 'Project Parameters'!H$8 * 'Project Parameters'!H$13 * Actuals!$F8, IF(Actuals!$C8 = 'Project Parameters'!$B$9, 'Project Parameters'!H$9 * 'Project Parameters'!H$13 * Actuals!$F8, IF(Actuals!$C8 = 'Project Parameters'!$B$10, 'Project Parameters'!H$10 * 'Project Parameters'!H$13 * Actuals!$F8, IF(Actuals!$C8 = 'Project Parameters'!$B$11, 'Project Parameters'!H$11 * 'Project Parameters'!H$13 * Actuals!$F8,error))))))","v":{"v":2000,"d":"€ 2,000.00"}},{"$f":"MONTH(Actuals!E8)","v":2},{"v":70000,"d":"€ 70,000.00"}]
[null,"Alpine Ski House",{"$f":" IF( Actuals!$C9 = 'Project Parameters'!$B$6, 'Project Parameters'!C$6 * 'Project Parameters'!C$13 * Actuals!$F9, IF(Actuals!$C9 = 'Project Parameters'!$B$7, 'Project Parameters'!C$7 * 'Project Parameters'!C$13 * Actuals!$F9, IF(Actuals!$C9 = 'Project Parameters'!$B$8, 'Project Parameters'!C$8 * 'Project Parameters'!C$13 * Actuals!$F9, IF(Actuals!$C9 = 'Project Parameters'!$B$9, 'Project Parameters'!C$9 * 'Project Parameters'!C$13 * Actuals!$F9, IF(Actuals!$C9 = 'Project Parameters'!$B$10, 'Project Parameters'!C$10 * 'Project Parameters'!C$13 * Actuals!$F9, IF(Actuals!$C9 = 'Project Parameters'!$B$11, 'Project Parameters'!C$11 * 'Project Parameters'!C$13 * Actuals!$F9,error))))))","v":{"v":12500,"d":"€ 12,500.00"}},{"$f":" IF( Actuals!$C9 = 'Project Parameters'!$B$6, 'Project Parameters'!D$6 * 'Project Parameters'!D$13 * Actuals!$F9, IF(Actuals!$C9 = 'Project Parameters'!$B$7, 'Project Parameters'!D$7 * 'Project Parameters'!D$13 * Actuals!$F9, IF(Actuals!$C9 = 'Project Parameters'!$B$8, 'Project Parameters'!D$8 * 'Project Parameters'!D$13 * Actuals!$F9, IF(Actuals!$C9 = 'Project Parameters'!$B$9, 'Project Parameters'!D$9 * 'Project Parameters'!D$13 * Actuals!$F9, IF(Actuals!$C9 = 'Project Parameters'!$B$10, 'Project Parameters'!D$10 * 'Project Parameters'!D$13 * Actuals!$F9, IF(Actuals!$C9 = 'Project Parameters'!$B$11, 'Project Parameters'!D$11 * 'Project Parameters'!D$13 * Actuals!$F9,error))))))","v":{"v":22500,"d":"€ 22,500.00"}},{"$f":" IF( Actuals!$C9 = 'Project Parameters'!$B$6, 'Project Parameters'!E$6 * 'Project Parameters'!E$13 * Actuals!$F9, IF(Actuals!$C9 = 'Project Parameters'!$B$7, 'Project Parameters'!E$7 * 'Project Parameters'!E$13 * Actuals!$F9, IF(Actuals!$C9 = 'Project Parameters'!$B$8, 'Project Parameters'!E$8 * 'Project Parameters'!E$13 * Actuals!$F9, IF(Actuals!$C9 = 'Project Parameters'!$B$9, 'Project Parameters'!E$9 * 'Project Parameters'!E$13 * Actuals!$F9, IF(Actuals!$C9 = 'Project Parameters'!$B$10, 'Project Parameters'!E$10 * 'Project Parameters'!E$13 * Actuals!$F9, IF(Actuals!$C9 = 'Project Parameters'!$B$11, 'Project Parameters'!E$11 * 'Project Parameters'!E$13 * Actuals!$F9,error))))))","v":{"v":10000,"d":"€ 10,000.00"}},{"$f":" IF( Actuals!$C9 = 'Project Parameters'!$B$6, 'Project Parameters'!F$6 * 'Project Parameters'!F$13 * Actuals!$F9, IF(Actuals!$C9 = 'Project Parameters'!$B$7, 'Project Parameters'!F$7 * 'Project Parameters'!F$13 * Actuals!$F9, IF(Actuals!$C9 = 'Project Parameters'!$B$8, 'Project Parameters'!F$8 * 'Project Parameters'!F$13 * Actuals!$F9, IF(Actuals!$C9 = 'Project Parameters'!$B$9, 'Project Parameters'!F$9 * 'Project Parameters'!F$13 * Actuals!$F9, IF(Actuals!$C9 = 'Project Parameters'!$B$10, 'Project Parameters'!F$10 * 'Project Parameters'!F$13 * Actuals!$F9, IF(Actuals!$C9 = 'Project Parameters'!$B$11, 'Project Parameters'!F$11 * 'Project Parameters'!F$13 * Actuals!$F9,error))))))","v":{"v":17500,"d":"€ 17,500.00"}},{"$f":" IF( Actuals!$C9 = 'Project Parameters'!$B$6, 'Project Parameters'!G$6 * 'Project Parameters'!G$13 * Actuals!$F9, IF(Actuals!$C9 = 'Project Parameters'!$B$7, 'Project Parameters'!G$7 * 'Project Parameters'!G$13 * Actuals!$F9, IF(Actuals!$C9 = 'Project Parameters'!$B$8, 'Project Parameters'!G$8 * 'Project Parameters'!G$13 * Actuals!$F9, IF(Actuals!$C9 = 'Project Parameters'!$B$9, 'Project Parameters'!G$9 * 'Project Parameters'!G$13 * Actuals!$F9, IF(Actuals!$C9 = 'Project Parameters'!$B$10, 'Project Parameters'!G$10 * 'Project Parameters'!G$13 * Actuals!$F9, IF(Actuals!$C9 = 'Project Parameters'!$B$11, 'Project Parameters'!G$11 * 'Project Parameters'!G$13 * Actuals!$F9,error))))))","v":{"v":22500,"d":"€ 22,500.00"}},{"$f":" IF( Actuals!$C9 = 'Project Parameters'!$B$6, 'Project Parameters'!H$6 * 'Project Parameters'!H$13 * Actuals!$F9, IF(Actuals!$C9 = 'Project Parameters'!$B$7, 'Project Parameters'!H$7 * 'Project Parameters'!H$13 * Actuals!$F9, IF(Actuals!$C9 = 'Project Parameters'!$B$8, 'Project Parameters'!H$8 * 'Project Parameters'!H$13 * Actuals!$F9, IF(Actuals!$C9 = 'Project Parameters'!$B$9, 'Project Parameters'!H$9 * 'Project Parameters'!H$13 * Actuals!$F9, IF(Actuals!$C9 = 'Project Parameters'!$B$10, 'Project Parameters'!H$10 * 'Project Parameters'!H$13 * Actuals!$F9, IF(Actuals!$C9 = 'Project Parameters'!$B$11, 'Project Parameters'!H$11 * 'Project Parameters'!H$13 * Actuals!$F9,error))))))","v":{"v":2500,"d":"€ 2,500.00"}},{"$f":"MONTH(Actuals!E9)","v":4},{"v":87500,"d":"€ 87,500.00"}]
{"$rows_left_out":22}
{"sheet":"Monthly Billings","index":3,"n_rows":29,"n_cols":16,"rows_kept":29}
[null,"[Company Name]  "]
[null,{"$f":" Actuals!B2","v":"Project Analysis for Business Consulting Firms"}]
[null,"Company Confidential"]
[]
[null,"Project name","Month of completion","Total\nbillings","January totals","February totals","March totals","April\ntotals","May\ntotals","June\ntotals","July totals","August totals","September totals","October totals","November totals","December totals"]
[null,"A. Datum Corporation",{"$f":"MONTH(Actuals!E7)","v":3},{"$f":"'Actual Totals'!J6","v":{"v":37500,"d":"€ 37,500.00"}},{"$f":"IF($C6 = 1, $D6, 0)","v":0},{"$f":"IF($C6 = 2, $D6, 0)","v":0},{"$f":"IF($C6 = 3, $D6, 0)","v":{"v":37500,"d":"€ 37,500.00"}},{"$f":"IF($C6 = 4, $D6, 0)","v":0},{"$f":"IF($C6 = 5, $D6, 0)","v":0},{"$f":"IF($C6 = 6, $D6, 0)","v":0},{"$f":"IF($C6 = 7, $D6, 0)","v":0},{"$f":"IF($C6 = 8, $D6, 0)","v":0},{"$f":"IF($C6 = 9, $D6, 0)","v":0},{"$f":"IF($C6 = 10, $D6, 0)","v":0},{"$f":"IF($C6 = 11, $D6, 0)","v":0},{"$f":"IF($C6 = 12, $D6, 0)","v":0}]
[null,"Adventure Works",{"$f":"MONTH(Actuals!E8)","v":2},{"$f":"'Actual Totals'!J7","v":{"v":70000,"d":"€ 70,000.00"}},{"$f":"IF($C7 = 1, $D7, 0)","v":0},{"$f":"IF($C7 = 2, $D7, 0)","v":{"v":70000,"d":"€ 70,000.00"}},{"$f":"IF($C7 = 3, $D7, 0)","v":0},{"$f":"IF($C7 = 4, $D7, 0)","v":0},{"$f":"IF($C7 = 5, $D7, 0)","v":0},{"$f":"IF($C7 = 6, $D7, 0)","v":0},{"$f":"IF($C7 = 7, $D7, 0)","v":0},{"$f":"IF($C7 = 8, $D7, 0)","v":0},{"$f":"IF($C7 = 9, $D7, 0)","v":0},{"$f":"IF($C7 = 10, $D7, 0)","v":0},{"$f":"IF($C7 = 11, $D7, 0)","v":0},{"$f":"IF($C7 = 12, $D7, 0)","v":0}]
[null,"Alpine Ski House",{"$f":"MONTH(Actuals!E9)","v":4},{"$f":"'Actual Totals'!J8","v":{"v":87500,"d":"€ 87,500.00"}},0,0,0,{"v":87500,"d":"€ 87,500.00"},0,0,0,0,0,0,0,0]
{"$rows_left_out":21}